makemkv-oss 1.9.8 for linux, compile failed

The place to discuss linux version of MakeMKV
Post Reply
fulwood
Posts: 3
Joined: Mon Dec 21, 2015 2:43 am

makemkv-oss 1.9.8 for linux, compile failed

Post by fulwood » Mon Dec 21, 2015 2:57 am

Hello,

I got makemkv-oss-1.9.8.tar.gz, but its comilation failed;

Makefile:59: recipe for target 'out/libmakemkv.so.1.full' failed
make: *** [out/libmakemkv.so.1.full] Error 1
make: *** Waiting for unfinished jobs.....

Any hint?

Thanks,

demon
Posts: 22
Joined: Sat Dec 20, 2014 7:06 am

Re: makemkv-oss 1.9.8 for linux, compile failed

Post by demon » Mon Dec 21, 2015 4:04 am

The make output by itself won't help much in diagnosing what's going on. You should really post the full output, so that people can see everything that's going on, including all the gcc/ld/as output.

fulwood
Posts: 3
Joined: Mon Dec 21, 2015 2:43 am

Re: makemkv-oss 1.9.8 for linux, compile failed

Post by fulwood » Mon Dec 21, 2015 4:41 am

> The make output by itself won't help much in diagnosing what's going on. You should really > post the full output, so that people can see everything that's going on, including all the
> gcc/ld/as output.

I see.

Anyway, makemkv-oss-1.9.8.tar.gz requires the very old files; libavcodec.so.54, libavutil.so.51?

It seemes to me.

Thanks
Attachments
make.log
(4.43 KiB) Downloaded 209 times

mike admin
Posts: 3581
Joined: Wed Nov 26, 2008 2:26 am
Contact:

Re: makemkv-oss 1.9.8 for linux, compile failed

Post by mike admin » Mon Dec 21, 2015 11:56 am

This is a bug. Here is a workaround - http://www.makemkv.com/forum2/viewtopic.php?f=3&t=10893

gjakob
Posts: 1
Joined: Fri Jan 03, 2014 9:38 am

Re: makemkv-oss 1.9.8 for linux, compile failed

Post by gjakob » Thu Dec 24, 2015 8:00 am

I'm using CentOS 7 with latest updates and also get compilation errors when I try to compile makemkv-oss version 1.9.8 (the previous version 1.9.7 worked without any problems).
Here is the output of the "make" process:

mkdir -p out
gcc -g -O2 -D_linux_ -D_GNU_SOURCE -D__STDC_CONSTANT_MACROS -D__STDC_LIMIT_MACROS -D_REENTRANT -shared -Wl,-z,defs -oout/libmakemkv.so.1.full -Ilibebml/inc -DEBML_NO_READ -DEBML_STRICT_API -DEBML_DEBUG -Ilibmatroska/inc \
-Ilibmakemkv/inc -Isstring/inc -Imakemkvgui/inc -Ilibabi/inc -Ilibffabi/inc -DDCA_LOG -DDCA_FFMALLOC \
libebml/src/EbmlBinary.cpp libebml/src/EbmlContexts.cpp libebml/src/EbmlCrc32.cpp libebml/src/EbmlDate.cpp libebml/src/EbmlDummy.cpp libebml/src/EbmlElement.cpp libebml/src/EbmlFloat.cpp libebml/src/EbmlHead.cpp libebml/src/EbmlMaster.cpp libebml/src/EbmlSInteger.cpp libebml/src/EbmlString.cpp libebml/src/EbmlSubHead.cpp libebml/src/EbmlUInteger.cpp libebml/src/EbmlUnicodeString.cpp libebml/src/EbmlVersion.cpp libebml/src/EbmlVoid.cpp libebml/src/IOCallback.cpp libebml/src/MemIOCallback.cpp libmatroska/src/FileKax.cpp libmatroska/src/KaxAttached.cpp libmatroska/src/KaxAttachments.cpp libmatroska/src/KaxBlock.cpp libmatroska/src/KaxBlockData.cpp libmatroska/src/KaxCluster.cpp libmatroska/src/KaxContexts.cpp libmatroska/src/KaxCues.cpp libmatroska/src/KaxCuesData.cpp libmatroska/src/KaxInfoData.cpp libmatroska/src/KaxSeekHead.cpp libmatroska/src/KaxSegment.cpp libmatroska/src/KaxTracks.cpp libmatroska/src/KaxVersion.cpp libmatroska/src/KaxSemantic.cpp libmakemkv/src/ebmlwrite.cpp libmakemkv/src/libmkv.cpp libmakemkv/src/version.cpp libmakemkv/src/world.cpp libmakemkv/src/stdstring.cpp sstring/src/sstring.cpp \
libabi/src/ossl_aes.c libabi/src/ossl_sha.c libabi/src/ossl_ec.c libabi/src/zlib.c libabi/src/xpat.c libabi/src/libm.c libabi/src/httplinux.cpp makemkvgui/src/api_linux.cpp libabi/src/sys_linux.c makemkvgui/src/spawn_posix.cpp libffabi/src/ffabi.c libffabi/src/mlp.c libffabi/src/log.c libffabi/src/audio_convert.c libffabi/src/audio_mix.c libffabi/src/audio_mix_matrix.c libffabi/src/dcadec/bitstream.cpp libffabi/src/dcadec/core_decoder.cpp libffabi/src/dcadec/dca_context.cpp libffabi/src/dcadec/dmix_tables.cpp libffabi/src/dcadec/exss_parser.cpp libffabi/src/dcadec/idct_fixed.cpp libffabi/src/dcadec/interpolator.cpp libffabi/src/dcadec/interpolator_fixed.cpp libffabi/src/dcadec/interpolator_float.cpp libffabi/src/dcadec/ta.cpp libffabi/src/dcadec/xll_decoder.cpp libffabi/src/dcadec/idct_float.cpp \
-DHAVE_BUILDINFO_H -Itmp -I/usr/local/include \
-fPIC -Xlinker -dy -Xlinker --version-script=libmakemkv/src/libmakemkv.vers \
-Xlinker -soname=libmakemkv.so.1 -lc -lstdc++ -lcrypto -lz -lexpat -pthread -L/usr/local/lib -lavcodec -lXv -lXext -lva-x11 -lva -lxcb-shm -lxcb-xfixes -lxcb-render -lxcb-shape -lxcb -lX11 -lcdio_paranoia -lcdio_cdda -lcdio -lasound -lSDL -lpthread -lxvidcore -lx265 -lx264 -lvpx -lvorbisenc -lvorbis -ltwolame -ltheoraenc -ltheoradec -logg -lopus -lopencore-amrwb -lopencore-amrnb -lmp3lame -lfdk-aac -lbluray -lass -laacplus -llzma -lbz2 -lz -lswresample -lavutil -lm -lm -lrt
libmakemkv/src/libmkv.cpp: In Elementfunktion »void MyMkvTrackInfo::RenderStat(libmatroska::KaxTags&, unsigned int, uint64_t, const char*)«:
libmakemkv/src/libmkv.cpp:379:53: Fehler: expected »)« before »PRIu64«
sprintf_s(buffer,sizeof(buffer),"%" PRIu64,values);
^
libmakemkv/src/libmkv.cpp:387:49: Fehler: expected »)« before »PRIu64«
sprintf_s(buffer,sizeof(buffer),"%" PRIu64,stat_bytes);
^
make: *** [out/libmakemkv.so.1.full] Fehler 1

tensoval
Posts: 3
Joined: Wed Jan 06, 2016 12:44 pm

Re: makemkv-oss 1.9.8 for linux, compile failed

Post by tensoval » Wed Jan 06, 2016 12:47 pm

I have a very similar error while trying to compile for amd64 on debian wheezy

nas1:~# cd /export/vol1_old/tmp/makemkv-oss-1.9.8
nas1:/export/vol1_old/tmp/makemkv-oss-1.9.8# ./configure
checking build system type... x86_64-unknown-linux-gnu
checking host system type... x86_64-unknown-linux-gnu
checking target system type... x86_64-unknown-linux-gnu
checking for gcc... gcc
checking whether the C compiler works... yes
checking for C compiler default output file name... a.out
checking for suffix of executables...
checking whether we are cross compiling... no
checking for suffix of object files... o
checking whether we are using the GNU C compiler... yes
checking whether gcc accepts -g... yes
checking for gcc option to accept ISO C89... none needed
checking for g++... g++
checking whether we are using the GNU C++ compiler... yes
checking whether g++ accepts -g... yes
checking for -objcopy... no
checking for objcopy... objcopy
checking for -ld... no
checking for ld... ld
checking for a BSD-compatible install... /usr/bin/install -c
checking how to run the C preprocessor... gcc -E
checking for grep that handles long lines and -e... /bin/grep
checking for egrep... /bin/grep -E
checking for ANSI C header files... yes
checking for sys/types.h... yes
checking for sys/stat.h... yes
checking for stdlib.h... yes
checking for string.h... yes
checking for memory.h... yes
checking for strings.h... yes
checking for inttypes.h... yes
checking for stdint.h... yes
checking for unistd.h... yes
checking zlib.h usability... yes
checking zlib.h presence... yes
checking for zlib.h... yes
checking for compress2 in -lz... yes
checking openssl/opensslconf.h usability... yes
checking openssl/opensslconf.h presence... yes
checking for openssl/opensslconf.h... yes
checking for AES_encrypt in -lcrypto... yes
checking expat.h usability... yes
checking expat.h presence... yes
checking for expat.h... yes
checking for XML_ParserCreate in -lexpat... yes
checking for pkg-config... /usr/bin/pkg-config
checking pkg-config is at least version 0.9.0... yes
checking for ffmpeg... yes
checking whether LIBAVCODEC_VERSION_MAJOR is declared... yes
checking LIBAVCODEC_VERSION_MAJOR... 54
checking for AVFrame.nb_samples... yes
checking whether AV_SAMPLE_FMT_U8P is declared... yes
checking for avcodec_encode_audio2... yes
checking for AVCodecContext.refcounted_frames... no
checking whether avcodec_free_frame is declared... yes
checking whether av_frame_free is declared... no
checking for av_log_format_line... yes
checking for enum AVCodecID... yes
checking whether AV_CODEC_ID_NONE is declared... yes
checking whether av_frame_get_channels is declared... yes
checking whether av_frame_get_sample_rate is declared... yes
checking whether av_frame_set_channel_layout is declared... yes
checking for AVCodecParserContext.duration... yes
checking whether AV_CH_TOP_BACK_CENTER is declared... no
checking for qt5... no
checking for qt4... yes
configure: creating ./config.status
config.status: creating Makefile
config.status: creating libffabi/src/ffabicfg.h
nas1:/export/vol1_old/tmp/makemkv-oss-1.9.8#
nas1:/export/vol1_old/tmp/makemkv-oss-1.9.8#
nas1:/export/vol1_old/tmp/makemkv-oss-1.9.8#
nas1:/export/vol1_old/tmp/makemkv-oss-1.9.8# make
mkdir -p out
gcc -g -O2 -D_linux_ -D_GNU_SOURCE -D__STDC_CONSTANT_MACROS -D__STDC_LIMIT_MACROS -D_REENTRANT -shared -Wl,-z,defs -oout/libdriveio.so.0.full -Ilibdriveio/inc libdriveio/src/infolist.cpp libdriveio/src/scsihlp.cpp libdriveio/src/srlist.cpp libdriveio/src/stdquery.cpp libdriveio/src/tipclient.cpp libdriveio/src/tipcommon.cpp libdriveio/src/tipserver.cpp libdriveio/src/drives/pioneer.cpp libdriveio/src/drives/xboxhddvd.cpp \
-fPIC -Xlinker -dy -Xlinker --version-script=libdriveio/src/libdriveio.vers \
-Xlinker -soname=libdriveio.so.0 -lc -lstdc++
objcopy --strip-all --strip-debug --strip-unneeded --discard-all out/libdriveio.so.0.full out/libdriveio.so.0
mkdir -p tmp
echo "#define BUILDINFO_ARCH_NAME \"x86_64-linux-gnu\"" >> tmp/gen_buildinfo.h
echo "#define BUILDINFO_BUILD_DATE \"Mi 6. Jan 13:36:40 CET 2016\"" >> tmp/gen_buildinfo.h
mkdir -p out
gcc -g -O2 -D_linux_ -D_GNU_SOURCE -D__STDC_CONSTANT_MACROS -D__STDC_LIMIT_MACROS -D_REENTRANT -shared -Wl,-z,defs -oout/libmakemkv.so.1.full -Ilibebml/inc -DEBML_NO_READ -DEBML_STRICT_API -DEBML_DEBUG -Ilibmatroska/inc \
-Ilibmakemkv/inc -Isstring/inc -Imakemkvgui/inc -Ilibabi/inc -Ilibffabi/inc -DDCA_LOG -DDCA_FFMALLOC \
libebml/src/EbmlBinary.cpp libebml/src/EbmlContexts.cpp libebml/src/EbmlCrc32.cpp libebml/src/EbmlDate.cpp libebml/src/EbmlDummy.cpp libebml/src/EbmlElement.cpp libebml/src/EbmlFloat.cpp libebml/src/EbmlHead.cpp libebml/src/EbmlMaster.cpp libebml/src/EbmlSInteger.cpp libebml/src/EbmlString.cpp libebml/src/EbmlSubHead.cpp libebml/src/EbmlUInteger.cpp libebml/src/EbmlUnicodeString.cpp libebml/src/EbmlVersion.cpp libebml/src/EbmlVoid.cpp libebml/src/IOCallback.cpp libebml/src/MemIOCallback.cpp libmatroska/src/FileKax.cpp libmatroska/src/KaxAttached.cpp libmatroska/src/KaxAttachments.cpp libmatroska/src/KaxBlock.cpp libmatroska/src/KaxBlockData.cpp libmatroska/src/KaxCluster.cpp libmatroska/src/KaxContexts.cpp libmatroska/src/KaxCues.cpp libmatroska/src/KaxCuesData.cpp libmatroska/src/KaxInfoData.cpp libmatroska/src/KaxSeekHead.cpp libmatroska/src/KaxSegment.cpp libmatroska/src/KaxTracks.cpp libmatroska/src/KaxVersion.cpp libmatroska/src/KaxSemantic.cpp libmakemkv/src/ebmlwrite.cpp libmakemkv/src/libmkv.cpp libmakemkv/src/version.cpp libmakemkv/src/world.cpp libmakemkv/src/stdstring.cpp sstring/src/sstring.cpp \
libabi/src/ossl_aes.c libabi/src/ossl_sha.c libabi/src/ossl_ec.c libabi/src/zlib.c libabi/src/xpat.c libabi/src/libm.c libabi/src/httplinux.cpp makemkvgui/src/api_linux.cpp libabi/src/sys_linux.c makemkvgui/src/spawn_posix.cpp libffabi/src/ffabi.c libffabi/src/mlp.c libffabi/src/log.c libffabi/src/audio_convert.c libffabi/src/audio_mix.c libffabi/src/audio_mix_matrix.c libffabi/src/dcadec/bitstream.cpp libffabi/src/dcadec/core_decoder.cpp libffabi/src/dcadec/dca_context.cpp libffabi/src/dcadec/dmix_tables.cpp libffabi/src/dcadec/exss_parser.cpp libffabi/src/dcadec/idct_fixed.cpp libffabi/src/dcadec/interpolator.cpp libffabi/src/dcadec/interpolator_fixed.cpp libffabi/src/dcadec/interpolator_float.cpp libffabi/src/dcadec/ta.cpp libffabi/src/dcadec/xll_decoder.cpp libffabi/src/dcadec/idct_float.cpp \
-DHAVE_BUILDINFO_H -Itmp \
-fPIC -Xlinker -dy -Xlinker --version-script=libmakemkv/src/libmakemkv.vers \
-Xlinker -soname=libmakemkv.so.1 -lc -lstdc++ -lcrypto -lz -lexpat -lavcodec -lavutil -lm -lrt
libmakemkv/src/libmkv.cpp: In member function \u2018void MyMkvTrackInfo::RenderStat(libmatroska::KaxTags&, unsigned int, uint64_t, const char*)\u2019:
libmakemkv/src/libmkv.cpp:379:53: error: expected \u2018)\u2019 before \u2018PRIu64\u2019
libmakemkv/src/libmkv.cpp:387:49: error: expected \u2018)\u2019 before \u2018PRIu64\u2019
make: *** [out/libmakemkv.so.1.full] Fehler 1
nas1:/export/vol1_old/tmp/makemkv-oss-1.9.8#


Any help is very much appreciated.

Thanks in advance.

Woodstock
Posts: 6204
Joined: Sun Jul 24, 2011 11:21 pm

Re: makemkv-oss 1.9.8 for linux, compile failed

Post by Woodstock » Wed Jan 06, 2016 3:51 pm

Tensoval, did you try the work-around Mike linked to?
How to aid in finding the answer to your problem: https://www.makemkv.com/faq/item/8

tensoval
Posts: 3
Joined: Wed Jan 06, 2016 12:44 pm

Re: makemkv-oss 1.9.8 for linux, compile failed

Post by tensoval » Wed Jan 06, 2016 4:58 pm

Woodstock wrote:Tensoval, did you try the work-around Mike linked to?

now i did and it worked - thanx

Post Reply